{"text_format":"3","workbook":"xlsx","n_sheets":4,"sheets":["１．基本情報シート","２．アセスメントチェックシート","３．課題整理総括表","プルダウン・素材用（入力不要）"],"not_rendered":{"images":31,"defined_names":4,"comments":3},"read":"whole","date_system":"1900"}

{"sheet":"１．基本情報シート","index":0,"n_rows":68,"n_cols":61,"rows_kept":68,"merged":[[1,13,1,34],[2,13,2,34],[3,13,3,34],[4,13,4,34],[7,13,7,34],[8,0,8,61],[10,7,10,8],[10,9,10,15],[10,16,10,17],[10,20,10,21],[10,22,10,29],[12,1,12,3],[12,4,12,13],[12,14,12,16],[12,17,12,20],[12,21,12,22],[12,23,12,24],[12,26,12,28],[12,32,13,34],[12,35,12,37],[12,38,12,42],[12,43,12,45],[12,46,12,52],[12,53,12,60],[13,1,13,3],[13,4,13,7],[13,8,13,9],[13,10,13,11],[13,13,13,19],[13,21,13,22],[13,23,13,29],[13,35,13,37],[13,38,13,42],[13,43,13,45],[13,46,13,52],[13,54,13,60],[14,1,14,4],[14,5,14,9],[14,11,14,19],[14,21,14,22],[14,23,14,24],[14,26,14,28],[14,32,14,37],[14,38,14,42],[14,43,14,49],[14,50,14,54],[14,55,14,60],[15,32,33,32],[15,33,16,36],[15,37,16,42],[15,43,16,48],[15,49,16,54],[15,55,16,60],[16,1,22,1],[16,2,16,4],[16,5,16,14],[16,15,16,29],[17,2,19,4],[17,5,17,12],[17,13,19,14],[17,15,19,16],[17,17,19,18],[17,19,19,26],[17,27,19,27],[17,28,19,28],[17,29,19,29],[17,33,17,36],[17,37,17,42],[17,43,17,48],[17,49,17,54],[17,55,17,60],[18,5,19,11],[18,12,19,12],[18,33,18,36],[18,37,18,38],[18,40,18,41],[18,43,18,44],[18,46,18,47],[18,49,18,50],[18,52,18,53],[18,55,18,56],[18,58,18,59],[19,33,21,34],[19,35,19,36],[19,37,19,42],[19,43,19,48],[19,49,19,54],[19,55,19,60],[20,2,22,4],[20,6,20,20],[20,21,20,22],[20,23,20,29],[20,35,21,36],[20,37,20,42],[20,43,20,48],[20,49,20,54],[20,55,20,60],[21,5,22,20],[21,21,21,22],[21,23,21,29],[21,37,21,39],[21,43,21,45],[21,49,21,51],[21,55,21,57],[22,21,22,22],[22,23,22,29],[22,33,23,36],[22,37,23,42],[22,43,23,48],[22,49,23,54],[22,55,23,60],[23,1,40,1],[23,2,23,4],[23,5,23,17],[23,18,40,18],[23,19,23,20],[23,21,23,23],[23,25,23,28],[24,2,27,17],[24,19,40,29],[24,33,24,36],[24,37,24,42],[24,43,24,48],[24,49,24,54],[24,55,24,60],[25,33,25,36],[25,37,25,42],[25,43,25,48],[25,49,25,54],[25,55,25,60],[26,33,33,33],[26,34,26,60],[27,34,33,60],[28,2,28,9],[28,10,28,12],[28,13,28,17],[29,2,34,2],[29,3,34,12],[29,13,40,17],[34,32,51,32],[34,33,34,35],[34,36,34,40],[34,42,34,44],[34,46,34,60],[34,63,61,82],[35,2,40,2],[35,3,40,12],[35,33,35,35],[35,36,35,37],[35,38,35,40],[35,41,35,42],[35,43,35,45],[35,46,51,60],[36,33,38,33],[36,34,36,35],[36,36,36,37],[36,39,36,40],[36,42,36,43],[36,44,36,45],[37,34,37,35],[37,36,37,37],[37,38,37,39],[37,40,37,41],[37,42,37,43],[37,44,37,45],[38,34,38,35],[38,36,38,45],[39,33,40,33],[39,34,39,35],[39,36,39,37],[39,38,39,39],[39,40,39,41],[39,42,39,43],[39,44,39,45],[40,34,40,35],[40,36,40,45],[41,1,50,1],[41,2,41,3],[41,4,41,8],[41,9,41,10],[41,11,41,12],[41,13,41,20],[41,21,41,29],[41,33,42,33],[41,34,41,35],[41,36,41,37],[41,38,41,39],[41,40,41,41],[41,42,41,43],[41,44,41,45],[42,2,44,3],[42,4,44,8],[42,9,44,10],[42,11,44,12],[42,13,44,20],[42,21,42,22],[42,23,42,29],[42,34,42,35],[42,36,42,37],[42,38,42,39],[42,40,42,45],[43,21,43,22],[43,23,43,29],[43,33,51,33],[43,34,51,45],[44,21,44,22],[44,23,44,29],[45,2,47,3],[45,4,47,8],[45,9,47,10],[45,11,47,12],[45,13,47,20],[45,21,45,22],[45,23,45,29],[46,21,46,22],[46,23,46,29],[47,21,47,22],[47,23,47,29],[48,2,50,3],[48,4,50,8],[48,9,50,10],[48,11,50,12],[48,13,50,20],[48,21,48,22],[48,23,48,29],[49,21,49,22],[49,23,49,29],[50,21,50,22],[50,23,50,29],[51,1,53,3],[51,4,51,8],[51,9,51,12],[51,13,51,22],[51,23,51,29],[52,4,53,8],[52,9,53,12],[52,13,53,22],[52,23,53,29],[52,32,52,34],[52,35,52,36],[52,38,52,44],[52,46,52,48],[52,49,52,50],[52,52,52,59],[53,32,60,32],[53,33,53,36],[53,37,53,39],[53,41,53,44],[53,46,53,48],[53,49,53,50],[53,52,53,54],[53,56,53,58],[53,59,53,60],[54,1,61,1],[54,2,54,3],[54,4,54,17],[54,18,54,21],[54,24,54,29],[54,33,54,36],[54,37,54,39],[54,40,54,43],[54,44,54,46],[54,47,54,50],[54,51,54,53],[54,54,54,57],[54,58,54,60],[55,2,61,17],[55,18,59,29],[55,33,55,36],[55,37,55,39],[55,40,55,43],[55,44,55,46],[55,47,55,50],[55,51,55,53],[55,54,55,57],[55,58,55,60],[56,33,60,33],[56,34,60,60],[60,18,60,21],[60,22,60,29],[61,18,61,21],[61,22,61,29],[61,32,71,32],[61,33,61,42],[61,43,61,45],[61,46,61,53],[61,54,61,60],[62,1,71,1],[62,2,62,4],[62,5,62,17],[62,18,62,29],[62,33,66,33],[62,34,62,42],[62,44,62,45],[62,46,62,53],[62,54,62,60],[63,2,71,17],[63,18,63,21],[63,22,63,25],[63,26,63,29],[63,34,63,42],[63,44,63,45],[63,46,63,53],[63,54,63,60],[64,18,64,21],[64,22,64,25],[64,26,64,29],[64,34,64,42],[64,44,64,45],[64,46,64,53],[64,54,64,60],[65,18,65,21],[65,22,65,25],[65,26,65,29],[65,34,65,42],[65,44,65,45],[65,46,65,53],[65,54,65,60],[66,18,66,21],[66,22,66,25],[66,26,66,29],[66,34,66,42],[66,44,66,45],[66,46,66,53],[66,54,66,60],[67,18,67,21],[67,22,67,25],[67,26,67,29],[67,33,71,33],[67,34,67,42],[67,44,67,45],[67,46,67,53],[67,54,67,60],[68,18,68,21],[68,22,68,25],[68,26,68,29],[68,34,68,42],[68,44,68,45],[68,46,68,53],[68,54,68,60],[69,18,69,21],[69,22,69,25],[69,26,69,29],[69,34,69,42],[69,44,69,45],[69,46,69,53],[69,54,69,60],[70,18,70,21],[70,22,70,25],[70,26,70,29],[70,34,70,42],[70,44,70,45],[70,46,70,53],[70,54,70,60],[71,18,71,21],[71,22,71,25],[71,26,71,29],[71,34,71,42],[71,44,71,45],[71,46,71,53],[71,54,71,60],[73,15,85,31]]}
[]
[{"$nulls":13},"【※１】 画面の拡大・縮小は、右下のパーセンテージで操作できます。"]
[{"$nulls":13},"【※２】薄黄色の項目は、プルダウン式になっています。"]
[{"$nulls":13},"【※３】黄色の項目は課題整理総括表へリンクします。"]
[{"$nulls":13},"【※４】薄緑色の項目はアセスメントチェックシートへリンクします。"]
[]
[]
[{"$nulls":13},"【※５】↓印刷範囲・入力項目などは、この下からです。↓"]
["基本情報シート"]
[]
[{"$nulls":7},"作成日",{"$nulls":8},"現在",{"$nulls":3},"作成者"]
[]
[null,"受付日",{"$nulls":12},"受付対応者",{"$nulls":6},"受付方法",{"$nulls":3},"（",{"$nulls":3},"）",null,null,"認定情報",null,null,"認定区分",{"$nulls":7},"認定年月日"]
[null,"相談者氏名",{"$nulls":6},"続柄",{"$nulls":3},"（",{"$nulls":7},"）","連絡先",{"$nulls":13},"区分支給限度額",null,null,{"$f":"IF(AM13=\"\",\"―\",VLOOKUP(AM13,'プルダウン・素材用（入力不要）'!$M$5:$N$12,2,FALSE))","v":"―"},{"$nulls":4},"認定期間",{"$nulls":9},"～"]
[null,"アセスメント理由",{"$nulls":8},"（",{"$nulls":9},"）","実施場所",{"$nulls":3},"（",{"$nulls":3},"）",null,null,"障害高齢者の日常生活自立度",{"$nulls":10},"認知症高齢者の日常生活自立度"]
[{"$nulls":32},"現在の受診状況","病名"]
[null,"利用者情報","被保険者番号"]
[null,null,"ふりがな\n氏　名",{"$nulls":10},"性別",{"$nulls":3},"生年月日",{"$nulls":9},"（　",{"$f":"IF(T18=\"\",\"\",DATEDIF(T18,TODAY(),\"Y\"))","v":""},"歳）",{"$nulls":3},"発症年月日"]
[{"$nulls":12},"様",{"$nulls":20},"薬の有無",{"$nulls":5},"（",null,null,"）",null,null,"（",null,null,"）",null,null,"（",null,null,"）",null,null,"（",null,null,"）"]
[{"$nulls":33},"受診",null,"状況"]
{"$rows_left_out":49}
{"sheet":"２．アセスメントチェックシート","index":1,"n_rows":88,"n_cols":81,"rows_kept":88,"merged":[[1,20,1,47],[2,20,2,47],[3,20,3,47],[4,20,4,47],[7,20,7,41],[8,0,9,3],[8,4,9,15],[8,16,9,17],[8,27,9,54],[8,84,8,88],[9,56,9,59],[9,60,9,71],[9,72,9,73],[9,76,9,79],[9,80,9,88],[11,0,16,3],[11,4,11,5],[11,6,11,28],[11,31,16,40],[11,41,13,42],[11,43,13,56],[11,57,13,58],[11,59,13,72],[11,73,13,74],[11,75,13,88],[12,4,12,5],[12,6,12,28],[13,4,13,5],[13,6,13,28],[14,4,14,5],[14,6,14,28],[14,41,16,42],[14,43,16,56],[14,57,16,58],[14,59,16,72],[14,73,16,74],[14,75,16,88],[15,4,15,5],[15,6,15,28],[16,4,16,5],[16,6,16,28],[18,0,19,5],[18,6,19,10],[18,11,18,53],[18,54,18,69],[18,71,19,74],[18,75,19,88],[19,11,19,17],[19,18,19,23],[19,24,19,33],[19,34,19,53],[19,54,19,61],[19,62,19,69],[20,0,35,5],[20,6,20,10],[20,11,20,12],[20,13,20,17],[20,18,20,23],[20,24,20,33],[20,34,20,53],[20,54,35,61],[20,62,35,69],[20,71,30,74],[20,75,30,88],[21,6,21,10],[21,11,21,12],[21,13,21,17],[21,18,21,23],[21,24,21,33],[21,34,21,53],[22,6,22,10],[22,11,22,12],[22,13,22,17],[22,18,22,23],[22,24,22,33],[22,34,22,53],[23,6,23,10],[23,11,23,12],[23,13,23,17],[23,18,23,23],[23,24,23,33],[23,34,23,53],[24,6,24,10],[24,11,24,12],[24,13,24,17],[24,18,24,23],[24,24,24,33],[24,34,24,53],[25,6,25,10],[25,11,25,12],[25,13,25,17],[25,18,25,21],[25,22,25,23],[25,24,25,33],[25,34,25,53],[26,6,26,10],[26,11,26,12],[26,13,26,17],[26,18,26,21],[26,22,26,23],[26,24,26,33],[26,34,26,53],[27,6,27,10],[27,11,27,12],[27,13,27,17],[27,18,27,21],[27,22,27,23],[27,24,27,33],[27,34,27,53],[28,6,28,10],[28,11,28,12],[28,13,28,17],[28,18,28,23],[28,24,28,33],[28,34,28,53],[29,6,29,10],[29,11,29,12],[29,13,29,17],[29,18,29,23],[29,24,29,33],[29,34,29,53],[30,6,30,10],[30,11,30,12],[30,13,30,17],[30,18,30,23],[30,24,30,33],[30,34,30,53],[31,6,31,10],[31,11,31,12],[31,13,31,17],[31,18,31,23],[31,24,31,33],[31,34,31,53],[31,71,41,74],[31,75,41,88],[32,6,32,10],[32,11,33,12],[32,13,33,17],[32,18,32,23],[32,24,32,33],[32,34,32,53],[33,6,33,10],[33,20,33,21],[33,23,33,24],[33,26,33,27],[33,29,33,30],[33,32,33,34],[33,36,33,38],[33,40,33,42],[33,44,33,46],[33,48,33,50],[33,52,33,53],[34,6,34,10],[34,11,35,12],[34,13,35,17],[34,18,34,23],[34,24,34,33],[34,34,34,53],[35,6,35,10],[35,20,35,21],[35,23,35,24],[35,26,35,27],[35,29,35,30],[35,32,35,34],[35,36,35,38],[35,40,35,42],[35,44,35,53],[36,0,53,5],[36,6,36,10],[36,11,36,12],[36,13,36,17],[36,18,36,23],[36,24,36,33],[36,34,36,53],[36,54,53,61],[36,62,53,69],[37,6,37,10],[37,11,37,12],[37,13,37,17],[37,18,37,23],[37,24,37,33],[37,34,37,53],[38,6,38,10],[38,11,38,12],[38,13,38,17],[38,18,38,23],[38,24,38,33],[38,34,38,53],[39,6,39,10],[39,11,39,12],[39,13,39,17],[39,18,39,23],[39,24,39,33],[39,34,39,53],[40,6,40,10],[40,11,40,12],[40,13,40,17],[40,18,40,23],[40,24,40,33],[40,34,40,53],[41,6,41,10],[41,11,41,12],[41,13,41,17],[41,18,41,23],[41,24,41,33],[41,34,41,53],[42,6,42,10],[42,11,42,12],[42,13,42,17],[42,18,42,23],[42,24,42,33],[42,34,42,53],[42,71,53,74],[42,75,53,88],[43,6,43,10],[43,11,43,12],[43,13,43,17],[43,18,43,23],[43,24,43,33],[43,34,43,53],[44,6,44,10],[44,11,44,12],[44,13,44,17],[44,18,44,23],[44,24,44,33],[44,34,44,53],[45,6,45,10],[45,11,45,12],[45,13,45,17],[45,18,45,23],[45,24,45,33],[45,34,45,53],[46,6,46,10],[46,11,46,12],[46,13,46,17],[46,18,46,23],[46,24,46,33],[46,34,46,53],[47,6,47,10],[47,11,47,12],[47,13,47,17],[47,18,47,23],[47,24,47,33],[47,34,47,53],[48,6,48,10],[48,11,48,12],[48,13,48,17],[48,18,48,23],[48,24,48,33],[48,34,48,53],[49,6,49,10],[49,11,49,12],[49,13,49,17],[49,18,49,23],[49,24,49,33],[49,34,49,53],[50,6,50,10],[50,11,50,12],[50,13,50,17],[50,18,50,23],[50,24,50,33],[50,34,50,53],[51,6,51,10],[51,11,51,12],[51,13,51,17],[51,18,51,23],[51,24,51,33],[51,34,51,53],[52,6,52,10],[52,11,52,12],[52,13,52,17],[52,18,52,23],[52,24,52,33],[52,34,52,53],[53,6,53,10],[53,11,53,12],[53,13,53,17],[53,18,53,23],[53,24,53,33],[53,34,53,53],[54,0,62,5],[54,6,54,10],[54,11,54,12],[54,13,54,17],[54,18,54,23],[54,24,54,33],[54,34,54,53],[54,54,62,61],[54,62,62,69],[54,71,63,74],[54,75,63,88],[55,6,55,10],[55,11,55,12],[55,13,55,17],[55,18,55,23],[55,24,55,33],[55,34,55,53],[56,6,56,10],[56,11,56,12],[56,13,56,17],[56,18,56,23],[56,24,56,33],[56,34,56,53],[57,6,57,10],[57,11,57,12],[57,13,57,17],[57,18,57,23],[57,24,57,33],[57,34,57,53],[58,6,58,10],[58,11,58,12],[58,13,58,17],[58,18,58,23],[58,24,58,33],[58,34,58,53],[59,6,59,10],[59,11,59,12],[59,13,59,17],[59,18,59,23],[59,24,59,33],[59,34,59,53],[60,6,60,10],[60,11,60,12],[60,13,60,17],[60,18,60,23],[60,24,60,33],[60,34,60,53],[61,6,61,10],[61,11,61,12],[61,13,61,17],[61,18,61,23],[61,24,61,33],[61,34,61,53],[62,6,62,10],[62,11,62,12],[62,13,62,17],[62,18,62,23],[62,24,62,33],[62,34,62,53],[63,0,68,5],[63,6,63,10],[63,11,63,12],[63,13,63,17],[63,18,63,23],[63,24,63,33],[63,34,63,53],[63,54,68,61],[63,62,68,69],[64,6,64,10],[64,11,64,12],[64,13,64,17],[64,18,64,23],[64,24,64,33],[64,34,64,53],[64,71,75,74],[64,75,75,88],[65,6,65,10],[65,11,65,12],[65,13,65,17],[65,18,65,23],[65,24,65,33],[65,34,65,53],[66,6,66,10],[66,11,66,12],[66,13,66,17],[66,18,66,23],[66,24,66,33],[66,34,66,53],[67,6,67,10],[67,11,67,12],[67,13,67,17],[67,18,67,23],[67,24,67,33],[67,34,67,53],[68,6,68,10],[68,11,68,12],[68,13,68,17],[68,18,68,23],[68,24,68,33],[68,34,68,53],[69,0,73,5],[69,6,69,10],[69,11,69,12],[69,13,69,17],[69,18,69,23],[69,24,69,33],[69,34,69,53],[69,54,73,61],[69,62,73,69],[70,6,70,10],[70,11,70,12],[70,13,70,17],[70,18,70,23],[70,24,70,33],[70,34,70,53],[71,6,71,10],[71,11,71,12],[71,13,71,17],[71,18,71,23],[71,24,71,33],[71,34,71,53],[72,6,72,10],[72,11,72,12],[72,13,72,17],[72,18,72,23],[72,24,72,33],[72,34,72,53],[73,6,73,10],[73,11,73,12],[73,13,73,17],[73,18,73,23],[73,24,73,33],[73,34,73,53],[74,0,76,5],[74,6,74,10],[74,11,74,12],[74,14,74,19],[74,21,74,23],[74,25,74,29],[74,31,74,35],[74,37,74,39],[74,41,74,43],[74,45,74,52],[74,54,76,61],[74,62,76,69],[75,6,75,10],[75,11,76,12],[75,13,76,53],[76,6,76,10],[76,71,87,74],[76,75,87,88],[77,0,77,5],[77,6,77,37],[77,38,77,69],[78,0,82,5],[78,6,78,7],[78,8,78,37],[78,38,78,39],[78,40,78,69],[79,6,79,7],[79,8,79,37],[79,38,79,39],[79,40,79,69],[80,6,80,7],[80,8,80,37],[80,38,80,39],[80,40,80,69],[81,6,81,7],[81,8,81,37],[81,38,81,39],[81,40,81,69],[82,6,82,7],[82,8,82,37],[82,38,82,39],[82,40,82,69],[83,0,87,5],[83,6,83,7],[83,8,83,37],[83,38,83,39],[83,40,83,69],[84,6,84,7],[84,8,84,37],[84,38,84,39],[84,40,84,69],[85,6,85,7],[85,8,85,37],[85,38,85,39],[85,40,85,69],[86,6,86,7],[86,8,86,37],[86,38,86,39],[86,40,86,69],[87,6,87,7],[87,8,87,37],[87,38,87,39],[87,40,87,69]]}
[]
[{"$nulls":20},"【※１】 画面の拡大・縮小は、右下のパーセンテージで操作できます。"]
[{"$nulls":20},"【※２】薄黄色の項目は、プルダウン式になっています。"]
[{"$nulls":20},"【※３】黄色の項目は課題整理総括表へリンクします。"]
[{"$nulls":20},"【※４】灰色のセルは記載不要（基本情報とリンクしています。）"]
[]
[]
[{"$nulls":20},"【※５】↓印刷範囲・入力項目などは、この下からです。↓"]
["利用者名",{"$nulls":3},{"$f":"IF('１．基本情報シート'!$F$19=\"\", \"\", '１．基本情報シート'!$F$19)","v":""},{"$nulls":11},"様",{"$nulls":10},"アセスメントシート"]
[{"$nulls":56},"作成日",{"$nulls":3},{"$f":"IF('１．基本情報シート'!$J$11=\"\", \"\", '１．基本情報シート'!$J$11)","v":""},{"$nulls":11},"現在",{"$nulls":3},"作成者",{"$nulls":3},{"$f":"IF('１．基本情報シート'!$W$11=\"\", , '１．基本情報シート'!$W$11)","v":0}]
[]
["A\n健康状態",{"$nulls":3},"1.",null,{"$f":"IF('１．基本情報シート'!$AL$16=\"\", \"\", '１．基本情報シート'!$AL$16)","v":""},{"$nulls":24},"根本的な原因・課題\n\n自立した日常生活の阻害要因\n（心身の状態、環境等）\n\n※課題整理総括表にリンク",{"$nulls":9},1,{"$nulls":15},2,{"$nulls":15},3]
[{"$nulls":4},"2.",null,{"$f":"IF('１．基本情報シート'!$AR$16=\"\", \"\", '１．基本情報シート'!$AR$16)","v":""}]
[{"$nulls":4},"3.",null,{"$f":"IF('１．基本情報シート'!$AX$16=\"\", \"\", '１．基本情報シート'!$AX$16)","v":""}]
[{"$nulls":4},"4.",null,{"$f":"IF('１．基本情報シート'!$BD$16=\"\", \"\", '１．基本情報シート'!$BD$16)","v":""},{"$nulls":34},4,{"$nulls":15},5,{"$nulls":15},6]
[{"$nulls":4},"5."]
[{"$nulls":4},"6."]
[]
[{"$nulls":6},"原 因",{"$nulls":4},"状況の事実（状態）",{"$nulls":42},"課題・ストレングス",{"$nulls":16},"関連項目",{"$nulls":3},"見通し"]
[{"$nulls":11},"項目",{"$nulls":6},"現在",{"$nulls":5},"備 考",{"$nulls":9},"できること・できそうなこと",{"$nulls":19},"課 題",{"$nulls":7},"ストレングス"]
{"$rows_left_out":69}
{"sheet":"３．課題整理総括表","index":2,"n_rows":50,"n_cols":160,"rows_kept":50,"merged":[[1,35,1,89],[2,35,2,89],[3,35,4,89],[7,35,7,89],[8,1,9,10],[8,11,9,30],[8,31,9,34],[8,59,9,104],[8,106,9,112],[8,113,9,131],[8,132,9,135],[8,138,9,144],[8,145,9,162],[11,106,16,111],[11,112,13,113],[11,114,13,162],[13,1,16,20],[13,21,14,23],[13,24,14,48],[13,49,14,51],[13,52,14,76],[13,77,14,79],[13,80,14,104],[14,112,16,113],[14,114,16,162],[15,21,16,23],[15,24,16,48],[15,49,16,51],[15,52,16,76],[15,77,16,79],[15,80,16,104],[17,1,19,20],[17,21,17,104],[18,21,19,30],[18,31,19,40],[18,41,19,66],[18,67,19,96],[18,97,19,104],[18,106,19,132],[18,133,19,158],[18,159,19,162],[20,1,21,6],[20,7,20,20],[20,21,20,30],[20,31,20,40],[20,41,20,66],[20,67,20,96],[20,97,20,104],[20,106,24,132],[20,133,24,158],[20,159,24,162],[21,7,21,20],[21,21,21,30],[21,31,21,40],[21,41,21,66],[21,67,21,96],[21,97,21,104],[22,1,24,6],[22,7,22,20],[22,21,22,30],[22,31,22,40],[22,41,22,66],[22,67,22,96],[22,97,22,104],[23,7,23,20],[23,21,23,30],[23,31,23,40],[23,41,23,66],[23,67,23,96],[23,97,23,104],[24,7,24,20],[24,21,24,30],[24,31,24,40],[24,41,24,66],[24,67,24,96],[24,97,24,104],[25,1,26,6],[25,7,25,20],[25,21,25,30],[25,31,25,40],[25,41,25,66],[25,67,25,96],[25,97,25,104],[25,106,29,132],[25,133,29,158],[25,159,29,162],[26,7,26,20],[26,21,26,30],[26,31,26,40],[26,41,26,66],[26,67,26,96],[26,97,26,104],[27,1,28,6],[27,7,27,20],[27,21,27,30],[27,31,27,40],[27,41,27,66],[27,67,27,96],[27,97,27,104],[28,7,28,20],[28,21,28,30],[28,31,28,40],[28,41,28,66],[28,67,28,96],[28,97,28,104],[29,1,29,20],[29,21,29,30],[29,31,29,40],[29,41,29,66],[29,67,29,96],[29,97,29,104],[30,1,30,20],[30,21,30,30],[30,31,30,40],[30,41,30,66],[30,67,30,96],[30,97,30,104],[30,106,33,132],[30,133,33,158],[30,159,33,162],[31,1,31,20],[31,21,31,30],[31,31,31,40],[31,41,31,66],[31,67,31,96],[31,97,31,104],[32,1,32,20],[32,21,32,30],[32,31,32,40],[32,41,32,66],[32,67,32,96],[32,97,32,104],[33,1,33,20],[33,21,33,30],[33,31,33,40],[33,41,33,66],[33,67,33,96],[33,97,33,104],[34,1,34,20],[34,21,34,30],[34,31,34,40],[34,41,34,66],[34,67,34,96],[34,97,34,104],[34,106,38,132],[34,133,38,158],[34,159,38,162],[35,1,35,20],[35,21,35,30],[35,31,35,40],[35,41,35,66],[35,67,35,96],[35,97,35,104],[36,1,36,20],[36,21,36,30],[36,31,36,40],[36,41,36,66],[36,67,36,96],[36,97,36,104],[37,1,37,20],[37,21,37,30],[37,31,37,40],[37,41,37,66],[37,67,37,96],[37,97,37,104],[38,1,38,20],[38,21,38,30],[38,31,38,40],[38,41,38,66],[38,67,38,96],[38,97,38,104],[39,1,39,20],[39,21,39,30],[39,31,39,40],[39,41,39,66],[39,67,39,96],[39,97,39,104],[39,106,43,132],[39,133,43,158],[39,159,43,162],[40,1,40,20],[40,21,40,30],[40,31,40,40],[40,41,40,66],[40,67,40,96],[40,97,40,104],[41,1,41,20],[41,21,41,30],[41,31,41,40],[41,41,41,66],[41,67,41,96],[41,97,41,104],[42,1,42,20],[42,21,42,30],[42,31,42,40],[42,41,42,66],[42,67,42,96],[42,97,42,104],[43,1,43,20],[43,21,43,30],[43,31,43,40],[43,41,43,66],[43,67,43,96],[43,97,43,104],[44,1,44,20],[44,21,44,30],[44,31,44,40],[44,41,44,66],[44,67,44,96],[44,97,44,104],[44,106,47,132],[44,133,47,158],[44,159,47,162],[45,1,45,20],[45,21,45,30],[45,31,45,40],[45,41,45,66],[45,67,45,96],[45,97,45,104],[46,1,46,20],[46,21,46,30],[46,31,46,40],[46,41,46,66],[46,67,46,96],[46,97,46,104],[47,1,47,20],[47,21,47,30],[47,31,47,40],[47,41,47,66],[47,67,47,96],[47,97,47,104],[49,1,51,104],[49,105,51,162]]}
[]
[{"$nulls":35},"【※１】 画面の拡大・縮小は、右下のパーセンテージで操作できます。"]
[{"$nulls":35},"【※２】薄黄色の項目は、プルダウン式になっています。"]
[{"$nulls":35},"【※３】灰色のセルは記載不要（基本情報・アセスメントチェックシートとリンクしています。）"]
[]
[]
[]
[{"$nulls":35},"【※４】↓印刷範囲・入力項目などは、この下からです。↓"]
[null,"利用者氏名",{"$nulls":9},{"$f":"IF('１．基本情報シート'!$F$19=\"\", \"\", '１．基本情報シート'!$F$19)","v":""},{"$nulls":19},"様",{"$nulls":27},"課題整理総括表",{"$nulls":46},"作成日",{"$nulls":6},{"$f":"IF('１．基本情報シート'!$J$11=\"\", \"\", '１．基本情報シート'!$J$11)","v":""},{"$nulls":18},"現在",{"$nulls":5},"作成者",{"$nulls":6},{"$f":"IF('１．基本情報シート'!$W$11=\"\", \"\", '１．基本情報シート'!$W$11)","v":""}]
[]
[]
[{"$nulls":106},"利用者及び家族の\n生活に対する意向",{"$nulls":5},"利用者",null,{"$f":"IF('１．基本情報シート'!D30=\"\",\"\",'１．基本情報シート'!D30)","v":""}]
[]
[null,"自立した日常生活の阻害要因\n（心身の状態、環境等）",{"$nulls":19},1,null,null,{"$f":"IF('２．アセスメントチェックシート'!AR12=\"\",\"\",'２．アセスメントチェックシート'!AR12)","v":""},{"$nulls":24},2,null,null,{"$f":"IF('２．アセスメントチェックシート'!BH12=\"\",\"\",'２．アセスメントチェックシート'!BH12)","v":""},{"$nulls":24},3,null,null,{"$f":"IF('２．アセスメントチェックシート'!BX12=\"\",\"\",'２．アセスメントチェックシート'!BX12)","v":""}]
[{"$nulls":112},"家族",null,{"$f":"IF('１．基本情報シート'!D36=\"\",\"\",'１．基本情報シート'!D36)","v":""}]
[{"$nulls":21},4,null,null,{"$f":"IF('２．アセスメントチェックシート'!AR15=\"\",\"\",'２．アセスメントチェックシート'!AR15)","v":""},{"$nulls":24},5,null,null,{"$f":"IF('２．アセスメントチェックシート'!BH15=\"\",\"\",'２．アセスメントチェックシート'!BH15)","v":""},{"$nulls":24},6,null,null,{"$f":"IF('２．アセスメントチェックシート'!BX15=\"\",\"\",'２．アセスメントチェックシート'!BX15)","v":""}]
[]
[null,"状況の事実　※１"]
[{"$nulls":21},"現在 ※２",{"$nulls":9},"要因 ※３",{"$nulls":9},"備考\n（状況・支援内容等）",{"$nulls":25},"できること・できそうなこと",{"$nulls":29},"改善/維持の\n可能性※４",{"$nulls":8},"見通し　※５",{"$nulls":26},"生活全般の解決すべき課題（ニーズ）\n【案】",{"$nulls":25},"※６"]
[]
{"$rows_left_out":31}
{"sheet":"プルダウン・素材用（入力不要）","index":3,"n_rows":49,"n_cols":48,"rows_kept":49,"hidden":true}
[]
["１．基本情報シート"]
["項目","受付方法","続柄","アセスメント理由","実施場所","性別","生年月日","家族状況（世帯）","介護者","家族情報（同居・別居）","日中の活動性","外出の頻度","認定情報","支給限度額","障害高齢者の日常生活自立度","認知症高齢者の日常生活自立度","薬の有無","受診状況","受診頻度１","受診頻度２","住居","所有形態","エレベーター","専用居室","段差（居室）","手すり（居室）","寝具（居室）","冷暖房（居室）","便器","段差（トイレ）","手すり（トイレ）","浴槽","シャワー","段差（浴室）","手すり（浴室）","住宅改修","福祉用具購入","年金種別","指定難病","療育手帳","身体障害者手帳","障害福祉サービス等の利用","介護保険負担割合","生活保護","医療保険負担割合","介護保険限度額認定証","日常生活自立支援事業","成年後見制度"]
["選択内容"]
[null,"来所","本人","初回","自宅","男","大正","独居","○","同居","よく動いている","1日1回以上","申請中","―","Ｊ１","自立","無","通院","定期","月","戸建（平屋）","持ち家","無","無","無","無","布団","無","和式","無","無","無","無","無","無","無","無","国民年金","無","無","無","無","１割","無","１割","１段階","無","無"]
[null,"電話","家族","更新","他","女","昭和","高齢者のみ",null,"別居","座っていることが多い","週1回以上","要支援１","5万30円","Ｊ２","Ⅰ","有","往診","不定期","週","戸建（２階建以上）","借家","有","有","有","有","ベッド","有","洋式","有","有","有","有","有","有","有","有","厚生年金","有","有","有（１級）","有","２割","有","２割","２段階","有","有（後見）"]
[null,"他","他","区分変更（改善）",{"$nulls":3},"他",null,null,"横になっていることが多い","月1回以上","要支援２","10万4,730円","Ａ１","Ⅱａ",{"$nulls":4},"アパート",{"$nulls":5},"特殊寝台",null,"ウォシュレット",{"$nulls":8},"障害年金",null,null,"有（２級）",null,"不明",null,"３割","３段階",null,"有（保佐）"]
[{"$nulls":3},"区分変更（悪化）",{"$nulls":6},"一日中ベッドで過ごす","月1回未満","要介護１","16万6,920円","Ａ２","Ⅱｂ",{"$nulls":4},"マンション",{"$nulls":16},"その他",null,null,"有（３級）",{"$nulls":3},"不明","４段階",null,"有（補助）"]
[{"$nulls":3},"退院",{"$nulls":8},"要介護２","19万6,160円","Ｂ１","Ⅲａ",{"$nulls":4},"公共住宅",{"$nulls":19},"有（４級）",{"$nulls":4},"不明"]
[{"$nulls":3},"退所",{"$nulls":8},"要介護３","26万9,310円","Ｂ２","Ⅲｂ",{"$nulls":4},"他",{"$nulls":19},"有（５級）"]
[{"$nulls":12},"要介護４","30万8,060円","Ｃ１","Ⅳ",{"$nulls":24},"有（６級）"]
[{"$nulls":12},"要介護５","36万650円","Ｃ２","Ｍ",{"$nulls":24},"有（７級）"]
[]
[]
[]
["２．アセスメントチェックシート（１）"]
["項目","移動（室内）","移動（屋外）","食事内容","食事摂取","排尿・排便","排泄動作","入浴","更衣","整容","寝返り","起き上がり","移乗","服薬","調理（献立・片付含む）","掃除（ゴミ出し含む）","洗濯","買物","整理・物品の管理","金銭管理","居住環境","コミュニケーション能力","視力","聴力","意思伝達"]
["選択内容"]
[null,"自立","自立","支障なし","自立","支障なし","自立","自立","自立","自立","自立","自立","自立","自立","自立","自立","自立","自立","自立","自立","支障なし","支障なし","問題無","問題無","できる"]
[null,"見守り","見守り","支障あり","見守り","支障あり","見守り","見守り","見守り","見守り","見守り","見守り","見守り","見守り","見守り","見守り","見守り","見守り","見守り","見守り","支障あり","支障あり","はっきり見えない","はっきり聞こえない","時々できる"]
{"$rows_left_out":29}